Reaction Details
TargetDeoxyuridine 5'-triphosphate nucleotidohydrolase
LigandBDBM50190543
Substrate/Competitorn/a
Meas. Tech.ChEMBL_564957 (CHEMBL957492)
Ki 200±n/a nM
Citation McCarthy, OMusso-Buendia, AKaiser, MBrun, RRuiz-Perez, LMJohansson, NGPacanowska, DGGilbert, IH Design, synthesis and evaluation of novel uracil acetamide derivatives as potential inhibitors of Plasmodium falciparum dUTP nucleotidohydrolase. Eur J Med Chem44:678-88 (2009) 
 
Deoxyuridine 5'-triphosphate nucleotidohydrolase
Name:Deoxyuridine 5'-triphosphate nucleotidohydrolase
Synonyms:dUTP pyrophosphatase
Type:Protein
Mol. Mass.:19574.43
Organism:Plasmodium falciparum
Description:Q8II92
Residue:173
BDBM50190543
NameBDBM50190543
TypeSmall organic molecule
Emp. Form.C28H27N3O4
Mol. Mass.469.5317
SMILESO[C@H]1C[C@@H](O[C@@H]1CNC(c1ccccc1)(c1ccccc1)c1ccccc1)n1ccc(=O)[nH]c1=O