Reaction Details
TargetPeroxisome proliferator-activated receptor alpha
LigandBDBM50261702
Substrate/Competitorn/a
Meas. Tech.ChEMBL_513557 (CHEMBL979053)
EC50 0.272±n/a nM
Citation Pingali, HJain, MShah, SMakadia, PZaware, PGoel, APatel, MGiri, SPatel, HPatel, P Design and synthesis of novel oxazole containing 1,3-dioxane-2-carboxylic acid derivatives as PPAR alpha/gamma dual agonists. Bioorg Med Chem16:7117-27 (2008) 
 
Peroxisome proliferator-activated receptor alpha
Name:Peroxisome proliferator-activated receptor alpha
Type:Enzyme
Mol. Mass.:52222.08
Organism:Homo sapiens (Human)
Description:Q07869
Residue:468
BDBM50261702
NameBDBM50261702
Synonyms:2-Methyl-c-5-[4-{2-(5-methyl-2-phenyloxazol-4-yl)ethoxy}benzyl]-1,3-dioxane-s-2-carboxylic acid | CHEMBL467349
TypeSmall organic molecule
Emp. Form.C25H27NO6
Mol. Mass.437.485
SMILESCc1oc(nc1CCOc1ccc(C[C@H]2CO[C@](C)(OC2)C(O)=O)cc1)-c1ccccc1