Reaction Details
TargetNeuropeptide Y receptor type 5
LigandBDBM50262002
Substrate/Competitorn/a
Meas. Tech.ChEMBL_509554 (CHEMBL997868)
Ki 24±n/a nM
Citation Sato, NJitsuoka, MShibata, THirohashi, TNonoshita, KMoriya, MHaga, YSakuraba, AAndo, MOhe, TIwaasa, HGomori, AIshihara, AKanatani, AFukami, T (9S)-9-(2-hydroxy-4,4-dimethyl-6-oxo-1-cyclohexen-1-yl)-3,3-dimethyl-2,3,4,9-tetrahydro-1H-xanthen-1-one, a selective and orally active neuropeptide Y Y5 receptor antagonist. J Med Chem51:4765-70 (2008) 
 
Neuropeptide Y receptor type 5
Name:Neuropeptide Y receptor type 5
Type:Enzyme
Mol. Mass.:50746.64
Organism:Homo sapiens (Human)
Description:Q15761
Residue:445
BDBM50262002
NameBDBM50262002
Synonyms:9'-(2-Hydroxy-4-oxospiro[5.5]undec-3-yl)-4',9'-dihydrospiro[cyclohexane-1,3'-xanthen]-1'(2'H)-one | CHEMBL466756
TypeSmall organic molecule
Emp. Form.C29H34O4
Mol. Mass.446.5779
SMILESO=C1CC2(CCCCC2)CC(=O)C1C1C2=C(CC3(CCCCC3)CC2=O)Oc2ccccc12