Reaction Details
TargetVascular endothelial growth factor receptor 2
LigandBDBM50262057
Substrate/Competitorn/a
Meas. Tech.ChEMBL_513999 (CHEMBL976314)
IC50 140±n/a nM
Citation Piatnitski Chekler, ELKatoch-Rouse, RKiselyov, ASSherman, DOuyang, XKim, KWang, YHadari, YRDoody, JF Synthesis and evaluation of heteroaryl-ketone derivatives as a novel class of VEGFR-2 inhibitors. Bioorg Med Chem Lett18:4344-7 (2008) 
 
Vascular endothelial growth factor receptor 2
Name:Vascular endothelial growth factor receptor 2
Type:Receptor Tyrosine Kinase
Mol. Mass.:151510.97
Organism:Homo sapiens (Human)
Description:P35968
Residue:1356
BDBM50262057
NameBDBM50262057
Synonyms:(2-((1H-indazol-6-yl)methylamino)phenyl)(1H-indol-3-yl)methanone | CHEMBL469038
TypeSmall organic molecule
Emp. Form.C23H18N4O
Mol. Mass.366.4152
SMILESO=C(c1c[nH]c2ccccc12)c1ccccc1NCc1ccc2cn[nH]c2c1