Reaction Details
TargetVascular endothelial growth factor receptor 2
LigandBDBM50261961
Substrate/Competitorn/a
Meas. Tech.ChEMBL_513999 (CHEMBL976314)
IC50 230±n/a nM
Citation Piatnitski Chekler, ELKatoch-Rouse, RKiselyov, ASSherman, DOuyang, XKim, KWang, YHadari, YRDoody, JF Synthesis and evaluation of heteroaryl-ketone derivatives as a novel class of VEGFR-2 inhibitors. Bioorg Med Chem Lett18:4344-7 (2008) 
 
Vascular endothelial growth factor receptor 2
Name:Vascular endothelial growth factor receptor 2
Type:Receptor Tyrosine Kinase
Mol. Mass.:151510.97
Organism:Homo sapiens (Human)
Description:P35968
Residue:1356
BDBM50261961
NameBDBM50261961
Synonyms:(1H-indazol-3-yl)(2-(quinolin-6-ylmethylamino)phenyl)methanone | CHEMBL469172
TypeSmall organic molecule
Emp. Form.C24H18N4O
Mol. Mass.378.4259
SMILESO=C(c1n[nH]c2ccccc12)c1ccccc1NCc1ccc2ncccc2c1