Reaction Details
TargetHistone deacetylase 3
LigandBDBM50261816
Substrate/Competitorn/a
Meas. Tech.ChEMBL_514671 (CHEMBL976443)
IC50 0.42±n/a nM
Citation Kozikowski, APTapadar, SLuchini, DNKim, KHBilladeau, DD Use of the nitrile oxide cycloaddition (NOC) reaction for molecular probe generation: a new class of enzyme selective histone deacetylase inhibitors (HDACIs) showing picomolar activity at HDAC6. J Med Chem51:4370-3 (2008) 
 
Histone deacetylase 3
Name:Histone deacetylase 3
Type:Enzyme
Mol. Mass.:48829.55
Organism:Homo sapiens (Human)
Description:O15379
Residue:428
BDBM50261816
NameBDBM50261816
Synonyms:CHEMBL511749 | tert-butyl 4-(3-((7-(hydroxyamino)-7-oxoheptyl)carbamoyl)isoxazol-5-yl)phenylcarbamate
TypeSmall organic molecule
Emp. Form.C22H30N4O6
Mol. Mass.446.4968
SMILESCC(C)(C)OC(=O)Nc1ccc(cc1)-c1cc(no1)C(=O)NCCCCCCC(=O)NO