Reaction Details
TargetDipeptidyl peptidase 4
LigandBDBM50242173
Substrate/Competitorn/a
Meas. Tech.ChEMBL_513704 (CHEMBL974554)
IC50 225000±n/a nM
Citation Tarragó, TKichik, NClaasen, BPrades, RTeixidó, MGiralt, E Baicalin, a prodrug able to reach the CNS, is a prolyl oligopeptidase inhibitor. Bioorg Med Chem16:7516-24 (2008) 
 
Dipeptidyl peptidase 4
Name:Dipeptidyl peptidase 4
Type:Enzyme
Mol. Mass.:88271.01
Organism:Homo sapiens (Human)
Description:P27487
Residue:766
BDBM50242173
NameBDBM50242173
Synonyms:(2S,3S,4S,5R,6S)-6-(5,6-dihydroxy-4-oxo-2-phenyl-4H-chromen-7-yloxy)-3,4,5-trihydroxy-tetrahydro-2H-pyran-2-carboxylic acid Baicalin (9) baicalin
TypeSmall organic molecule
Emp. Form.C21H18O11
Mol. Mass.446.361
SMILESO[C@H]1[C@H](Oc2cc3oc(cc(=O)c3c(O)c2O)-c2ccccc2)O[C@@H]([C@@H](O)[C@@H]1O)C(O)=O