Reaction Details
TargetCytochrome P450 11B1, mitochondrial
LigandBDBM8611
Substrate/Competitorn/a
Meas. Tech.ChEMBL_510155 (CHEMBL1002228)
IC50 10±n/a nM
Citation Heim, RLucas, SGrombein, CMRies, CSchewe, KENegri, MMüller-Vieira, UBirk, BHartmann, RW Overcoming undesirable CYP1A2 inhibition of pyridylnaphthalene-type aldosterone synthase inhibitors: influence of heteroaryl derivatization on potency and selectivity. J Med Chem51:5064-74 (2008) 
 
Cytochrome P450 11B1, mitochondrial
Name:Cytochrome P450 11B1, mitochondrial
Type:Enzyme
Mol. Mass.:57591.44
Organism:Homo sapiens (Human)
Description:P15538
Residue:503
BDBM8611
NameBDBM8611
Synonyms:4-{5H,6H,7H,8H-imidazo[1,5-a]pyridin-5-yl}benzonitrile CHEMBL9298 US9271963, Fadrozole
TypeSmall organic molecule
Emp. Form.C14H13N3
Mol. Mass.223.2731
SMILESN#Cc1ccc(cc1)C1CCCc2cncn12