Reaction Details
TargetB1 bradykinin receptor
LigandBDBM50272416
Substrate/Competitorn/a
Meas. Tech.ChEMBL_510232 (CHEMBL1005610)
IC50 1.2±n/a nM
Citation Chen, JJQian, WBiswas, KViswanadhan, VNAskew, BCHitchcock, SHungate, RWArik, LJohnson, E Discovery of dihydroquinoxalinone acetamides containing bicyclic amines as potent Bradykinin B1 receptor antagonists. Bioorg Med Chem Lett18:4477-81 (2008) 
 
B1 bradykinin receptor
Name:B1 bradykinin receptor
Type:Enzyme
Mol. Mass.:40508.87
Organism:Homo sapiens (Human)
Description:P46663
Residue:353
BDBM50272416
NameBDBM50272416
Synonyms:CHEMBL496459 | N-((R)-7-(aminomethyl)chroman-4-yl)-2-((R)-1-(3,4-dichlorophenylsulfonyl)-3-oxo-1,2,3,4-tetrahydroquinoxalin-2-yl)acetamide
TypeSmall organic molecule
Emp. Form.C26H24Cl2N4O5S
Mol. Mass.575.464
SMILESNCc1ccc2[C@@H](CCOc2c1)NC(=O)C[C@H]1N(c2ccccc2NC1=O)S(=O)(=O)c1ccc(Cl)c(Cl)c1