Reaction Details
TargetB1 bradykinin receptor
LigandBDBM50272415
Substrate/Competitorn/a
Meas. Tech.ChEMBL_510232 (CHEMBL1005610)
IC50>4000±n/a nM
Citation Chen, JJQian, WBiswas, KViswanadhan, VNAskew, BCHitchcock, SHungate, RWArik, LJohnson, E Discovery of dihydroquinoxalinone acetamides containing bicyclic amines as potent Bradykinin B1 receptor antagonists. Bioorg Med Chem Lett18:4477-81 (2008) 
 
B1 bradykinin receptor
Name:B1 bradykinin receptor
Type:Enzyme
Mol. Mass.:40508.87
Organism:Homo sapiens (Human)
Description:P46663
Residue:353
BDBM50272415
NameBDBM50272415
Synonyms:2-(1-(mesitylsulfonyl)-3-oxo-1,2,3,4-tetrahydronoxalin-2-yl)-N-(2-methoxyphenyl)acetamide | CHEMBL498679
TypeSmall organic molecule
Emp. Form.C26H27N3O5S
Mol. Mass.493.575
SMILESCOc1ccccc1NC(=O)CC1N(c2ccccc2NC1=O)S(=O)(=O)c1c(C)cc(C)cc1C