Reaction Details
TargetB1 bradykinin receptor
LigandBDBM50272477
Substrate/Competitorn/a
Meas. Tech.ChEMBL_510232 (CHEMBL1005610)
IC50 62±n/a nM
Citation Chen, JJQian, WBiswas, KViswanadhan, VNAskew, BCHitchcock, SHungate, RWArik, LJohnson, E Discovery of dihydroquinoxalinone acetamides containing bicyclic amines as potent Bradykinin B1 receptor antagonists. Bioorg Med Chem Lett18:4477-81 (2008) 
 
B1 bradykinin receptor
Name:B1 bradykinin receptor
Type:Enzyme
Mol. Mass.:40508.87
Organism:Homo sapiens (Human)
Description:P46663
Residue:353
BDBM50272477
NameBDBM50272477
Synonyms:2-((R)-1-(3,4-dichlorophenylsulfonyl)-3-oxo-1,2,3,4-tetrahydroquinoxalin-2-yl)-N-((R)-7-(hydroxymethyl)chroman-4-yl)acetamide | CHEMBL498488
TypeSmall organic molecule
Emp. Form.C26H23Cl2N3O6S
Mol. Mass.576.448
SMILESOCc1ccc2[C@@H](CCOc2c1)NC(=O)C[C@H]1N(c2ccccc2NC1=O)S(=O)(=O)c1ccc(Cl)c(Cl)c1