Reaction Details
TargetB1 bradykinin receptor
LigandBDBM50272454
Substrate/Competitorn/a
Meas. Tech.ChEMBL_510231 (CHEMBL1005609)
Ki 1.8±n/a nM
Citation Chen, JJQian, WBiswas, KViswanadhan, VNAskew, BCHitchcock, SHungate, RWArik, LJohnson, E Discovery of dihydroquinoxalinone acetamides containing bicyclic amines as potent Bradykinin B1 receptor antagonists. Bioorg Med Chem Lett18:4477-81 (2008) 
 
B1 bradykinin receptor
Name:B1 bradykinin receptor
Type:Enzyme
Mol. Mass.:40508.87
Organism:Homo sapiens (Human)
Description:P46663
Residue:353
BDBM50272454
NameBDBM50272454
Synonyms:CHEMBL525092 | N-((R)-7-((tert-butylamino)methyl)chroman-4-yl)-2-((R)-3-oxo-1-(phenylsulfonyl)-1,2,3,4-tetrahydroquinoxalin-2-yl)acetamide
TypeSmall organic molecule
Emp. Form.C30H34N4O5S
Mol. Mass.562.68
SMILESCC(C)(C)NCc1ccc2[C@@H](CCOc2c1)NC(=O)C[C@H]1N(c2ccccc2NC1=O)S(=O)(=O)c1ccccc1