Reaction Details
TargetB1 bradykinin receptor
LigandBDBM50272448
Substrate/Competitorn/a
Meas. Tech.ChEMBL_510232 (CHEMBL1005610)
IC50 1±n/a nM
Citation Chen, JJQian, WBiswas, KViswanadhan, VNAskew, BCHitchcock, SHungate, RWArik, LJohnson, E Discovery of dihydroquinoxalinone acetamides containing bicyclic amines as potent Bradykinin B1 receptor antagonists. Bioorg Med Chem Lett18:4477-81 (2008) 
 
B1 bradykinin receptor
Name:B1 bradykinin receptor
Type:Enzyme
Mol. Mass.:40508.87
Organism:Homo sapiens (Human)
Description:P46663
Residue:353
BDBM50272448
NameBDBM50272448
Synonyms:2-((R)-1-(3,4-dichlorophenylsulfonyl)-3-oxo-1,2,3,4-tetrahydroquinoxalin-2-yl)-N-((R)-7-((dimethylamino)methyl)chroman-4-yl)acetamide | CHEMBL504119
TypeSmall organic molecule
Emp. Form.C28H28Cl2N4O5S
Mol. Mass.603.517
SMILESCN(C)Cc1ccc2[C@@H](CCOc2c1)NC(=O)C[C@H]1N(c2ccccc2NC1=O)S(=O)(=O)c1ccc(Cl)c(Cl)c1