Reaction Details
TargetCoagulation factor X
LigandBDBM35743
Substrate/Competitorn/a
Meas. Tech.ChEMBL_510288 (CHEMBL1008201)
IC50 5.1±n/a nM
Citation Nagata, TNagamochi, MKobayashi, SKomoriya, SYoshino, TKanno, H Stereoselective synthesis and biological evaluation of 3,4-diaminocyclohexanecarboxylic acid derivatives as factor Xa inhibitors. Bioorg Med Chem Lett18:4587-92 (2008) 
 
Coagulation factor X
Name:Coagulation factor X
Type:Enzyme
Mol. Mass.:54726.60
Organism:Homo sapiens (Human)
Description:n/a
Residue:488
BDBM35743
NameBDBM35743
Synonyms:CHEMBL479863 | cis-1,2-diaminocyclohexane derivative, A
TypeSmall organic molecule
Emp. Form.C26H31ClN6O3S
Mol. Mass.543.081
SMILESCN(C)C(=O)[C@H]1CC[C@H](NC(=O)c2cc3cc(Cl)ccc3[nH]2)[C@@H](C1)NC(=O)c1nc2CCN(C)Cc2s1