Reaction Details
TargetVascular endothelial growth factor receptor 2
LigandBDBM50245334
Substrate/Competitorn/a
Meas. Tech.ChEMBL_513139 (CHEMBL973628)
IC50 344±n/a nM
Citation Bauer, DWhittington, DACoxon, ABready, JHarriman, SPPatel, VFPolverino, AHarmange, JC Evaluation of indazole-based compounds as a new class of potent KDR/VEGFR-2 inhibitors. Bioorg Med Chem Lett18:4844-8 (2008) 
 
Vascular endothelial growth factor receptor 2
Name:Vascular endothelial growth factor receptor 2
Type:Receptor Tyrosine Kinase
Mol. Mass.:151510.97
Organism:Homo sapiens (Human)
Description:P35968
Residue:1356
BDBM50245334
NameBDBM50245334
Synonyms:CHEMBL462382 | N-(6-(6,7-dimethoxyquinolin-4-yloxy)-1-methyl-1H-indazol-3-yl)cyclopropanecarboxamide
TypeSmall organic molecule
Emp. Form.C23H22N4O4
Mol. Mass.418.4452
SMILESCOc1cc2nccc(Oc3ccc4c(NC(=O)C5CC5)nn(C)c4c3)c2cc1OC