Reaction Details
TargetVascular endothelial growth factor receptor 2
LigandBDBM50245291
Substrate/Competitorn/a
Meas. Tech.ChEMBL_513139 (CHEMBL973628)
IC50 270±n/a nM
Citation Bauer, DWhittington, DACoxon, ABready, JHarriman, SPPatel, VFPolverino, AHarmange, JC Evaluation of indazole-based compounds as a new class of potent KDR/VEGFR-2 inhibitors. Bioorg Med Chem Lett18:4844-8 (2008) 
 
Vascular endothelial growth factor receptor 2
Name:Vascular endothelial growth factor receptor 2
Type:Receptor Tyrosine Kinase
Mol. Mass.:151510.97
Organism:Homo sapiens (Human)
Description:P35968
Residue:1356
BDBM50245291
NameBDBM50245291
Synonyms:6-(6,7-dimethoxyquinolin-4-yloxy)-1-methyl-N-phenyl-1H-indazol-3-amine | CHEMBL458330
TypeSmall organic molecule
Emp. Form.C25H22N4O3
Mol. Mass.426.4672
SMILESCOc1cc2nccc(Oc3ccc4c(Nc5ccccc5)nn(C)c4c3)c2cc1OC