Reaction Details
TargetMitogen-activated protein kinase 14
LigandBDBM50245420
Substrate/Competitorn/a
Meas. Tech.ChEMBL_513150 (CHEMBL973639)
IC50 1650±n/a nM
Citation Bauer, DWhittington, DACoxon, ABready, JHarriman, SPPatel, VFPolverino, AHarmange, JC Evaluation of indazole-based compounds as a new class of potent KDR/VEGFR-2 inhibitors. Bioorg Med Chem Lett18:4844-8 (2008) 
 
Mitogen-activated protein kinase 14
Name:Mitogen-activated protein kinase 14
Type:Serine/threonine-protein kinase
Mol. Mass.:41286.76
Organism:Homo sapiens (Human)
Description:Q16539
Residue:360
BDBM50245420
NameBDBM50245420
Synonyms:CHEMBL462168 | N-(6-(6,7-dimethoxyquinolin-4-yloxy)-1-methyl-1H-indazol-3-yl)-3-(trifluoromethyl)benzamide
TypeSmall organic molecule
Emp. Form.C27H21F3N4O4
Mol. Mass.522.4752
SMILESCOc1cc2nccc(Oc3ccc4c(NC(=O)c5cccc(c5)C(F)(F)F)nn(C)c4c3)c2cc1OC