Reaction Details
TargetProtein kinase C alpha type
LigandBDBM50245049
Substrate/Competitorn/a
Meas. Tech.ChEMBL_512395 (CHEMBL979906)
Ki 3.1±n/a nM
Citation Duan, DSigano, DMKelley, JALai, CCLewin, NEKedei, NPeach, MLLee, JAbeyweera, TPRotenberg, SAKim, HKim, YHEl Kazzouli, SChung, JUYoung, HAYoung, MRBaker, AColburn, NHHaimovitz-Friedman, ATruman, JPParrish, DADeschamps, JRPerry, NASurawski, RJBlumberg, PMMarquez, VE Conformationally constrained analogues of diacylglycerol. 29. Cells sort diacylglycerol-lactone chemical zip codes to produce diverse and selective biological activities. J Med Chem51:5198-220 (2008) 
 
Protein kinase C alpha type
Name:Protein kinase C alpha type
Type:Enzyme Catalytic Domain
Mol. Mass.:76858.67
Organism:MOUSE
Description:Protein kinase C 0 MOUSE::P20444
Residue:672
BDBM50245049
NameBDBM50245049
Synonyms:CHEMBL488706 | rac-(E)-{2-(Hydroxymethyl)-4-[(4-nitrophenyl)methylene]-5-oxo-2-2,3-dihydrofuryl}methyl 2-Ethylhexanoate
TypeSmall organic molecule
Emp. Form.C21H27NO7
Mol. Mass.405.4416
SMILESCCCCC(CC)C(=O)OCC1(CO)C\C(=C/c2ccc(cc2)[N+]([O-])=O)C(=O)O1