Reaction Details
TargetRas guanyl-releasing protein 3
LigandBDBM50244865
Substrate/Competitorn/a
Meas. Tech.ChEMBL_512396 (CHEMBL979907)
Ki 2.3±n/a nM
Citation Duan, DSigano, DMKelley, JALai, CCLewin, NEKedei, NPeach, MLLee, JAbeyweera, TPRotenberg, SAKim, HKim, YHEl Kazzouli, SChung, JUYoung, HAYoung, MRBaker, AColburn, NHHaimovitz-Friedman, ATruman, JPParrish, DADeschamps, JRPerry, NASurawski, RJBlumberg, PMMarquez, VE Conformationally constrained analogues of diacylglycerol. 29. Cells sort diacylglycerol-lactone chemical zip codes to produce diverse and selective biological activities. J Med Chem51:5198-220 (2008) 
 
Ras guanyl-releasing protein 3
Name:Ras guanyl-releasing protein 3
Type:PROTEIN
Mol. Mass.:78335.20
Organism:Homo sapiens (Human)
Description:ChEMBL_1364407
Residue:690
BDBM50244865
NameBDBM50244865
Synonyms:CHEMBL471153 | rac-(E)-{2-(Hydroxymethyl)-4-[(4-nitrophenyl)methylene]-5-oxo-2-2,3-dihydrofuryl}methyl 3-(dimethylamino)benzoate
TypeSmall organic molecule
Emp. Form.C22H22N2O7
Mol. Mass.426.4193
SMILESCN(C)c1cccc(c1)C(=O)OCC1(CO)C\C(=C/c2ccc(cc2)[N+]([O-])=O)C(=O)O1