Reaction Details
TargetIndoleamine 2,3-dioxygenase 1
LigandBDBM50247143
Substrate/Competitorn/a
Meas. Tech.ChEMBL_557744 (CHEMBL953253)
Ki 367000±n/a nM
Citation Nakashima, HUto, YNakata, ENagasawa, HIkkyu, KHiraoka, NNakashima, KSasaki, YSugimoto, HShiro, YHashimoto, TOkamoto, YAsakawa, YHori, H Synthesis and biological activity of 1-methyl-tryptophan-tirapazamine hybrids as hypoxia-targeting indoleamine 2,3-dioxygenase inhibitors. Bioorg Med Chem16:8661-9 (2008) 
 
Indoleamine 2,3-dioxygenase 1
Name:Indoleamine 2,3-dioxygenase 1
Type:Enzyme
Mol. Mass.:45330.80
Organism:Homo sapiens (Human)
Description:P14902
Residue:403
BDBM50247143
NameBDBM50247143
Synonyms:CHEMBL513210 [4-(1,4-Dioxido-1,2,4-benzotriazin-3-yl)aminobutyl]-(2S)-N-tert-butoxycarbonyl-2-amino-(1-methyl-indole-3-yl)propanamide
TypeSmall organic molecule
Emp. Form.C28H35N7O5
Mol. Mass.549.6214
SMILESCn1cc(C[C@H](NC(=O)OC(C)(C)C)C(=O)NCCCCNc2n[n+]([O-])c3ccccc3[n+]2[O-])c2ccccc12