Reaction Details
TargetIndoleamine 2,3-dioxygenase 1
LigandBDBM50247141
Substrate/Competitorn/a
Meas. Tech.ChEMBL_557744 (CHEMBL953253)
Ki 197000±n/a nM
Citation Nakashima, HUto, YNakata, ENagasawa, HIkkyu, KHiraoka, NNakashima, KSasaki, YSugimoto, HShiro, YHashimoto, TOkamoto, YAsakawa, YHori, H Synthesis and biological activity of 1-methyl-tryptophan-tirapazamine hybrids as hypoxia-targeting indoleamine 2,3-dioxygenase inhibitors. Bioorg Med Chem16:8661-9 (2008) 
 
Indoleamine 2,3-dioxygenase 1
Name:Indoleamine 2,3-dioxygenase 1
Type:Enzyme
Mol. Mass.:45330.80
Organism:Homo sapiens (Human)
Description:P14902
Residue:403
BDBM50247141
NameBDBM50247141
Synonyms:CHEMBL443424 [5-(1,4-Dioxido-1,2,4-benzotriazin-3-yl)aminopentyl]-(2S)-N-tert-butoxycarbonyl-2-amino-(1-methyl-indole-3-yl)propanamide
TypeSmall organic molecule
Emp. Form.C29H37N7O5
Mol. Mass.563.648
SMILESCn1cc(C[C@H](NC(=O)OC(C)(C)C)C(=O)NCCCCCNc2n[n+]([O-])c3ccccc3[n+]2[O-])c2ccccc12