Reaction Details
TargetGrowth hormone secretagogue receptor type 1
LigandBDBM50264552
Substrate/Competitorn/a
Meas. Tech.ChEMBL_535176 (CHEMBL988115)
EC50 2±n/a nM
Citation Zhai, WFlynn, NLonghi, DATino, JAMurphy, BJSlusarchyk, DGordon, DAPendri, AShi, SStoffel, RMa, BSofia, MJGerritz, SW Discovery and optimization of (R)-prolinol-derived agonists of the Growth Hormone Secretagogue receptor (GHSR). Bioorg Med Chem Lett18:5083-6 (2008) 
 
Growth hormone secretagogue receptor type 1
Name:Growth hormone secretagogue receptor type 1
Type:Receptor
Mol. Mass.:41334.57
Organism:Homo sapiens (Human)
Description:Receptor binding studies use plasma membranes from LLC PK-1 cells transiently transfected with hGHSR1a.
Residue:366
BDBM50264552
NameBDBM50264552
Synonyms:(S)-2-(3-Chloro-phenoxy)-N-(2-methyl-benzyl)-N-(R)-1-pyrrolidin-2-ylmethyl-propionamide | CHEMBL519322
TypeSmall organic molecule
Emp. Form.C22H27ClN2O2
Mol. Mass.386.915
SMILESC[C@H](Oc1cccc(Cl)c1)C(=O)N(C[C@H]1CCCN1)Cc1ccccc1C