Reaction Details
TargetTransient receptor potential cation channel subfamily V member 1
LigandBDBM20466
Substrate/Competitorn/a
Meas. Tech.ChEMBL_535193 (CHEMBL990789)
IC50 17±n/a nM
Citation Brown, BSKeddy, RZheng, GZSchmidt, RGKoenig, JRMcDonald, HABianchi, BRHonore, PJarvis, MFSurowy, CSPolakowski, JSMarsh, KCFaltynek, CRLee, CH Tetrahydropyridine-4-carboxamides as novel, potent transient receptor potential vanilloid 1 (TRPV1) antagonists. Bioorg Med Chem16:8516-25 (2008) 
 
Transient receptor potential cation channel subfamily V member 1
Name:Transient receptor potential cation channel subfamily V member 1
Type:Transient Receptor
Mol. Mass.:94956.12
Organism:Rattus norvegicus (rat)
Description:O35433
Residue:838
BDBM20466
NameBDBM20466
Synonyms:A-784168 N-[4-(trifluoromethane)sulfonylphenyl]-1-[3-(trifluoromethyl)pyridin-2-yl]-1,2,3,6-tetrahydropyridine-4-carboxamide
TypeSmall organic molecule
Emp. Form.C19H15F6N3O3S
Mol. Mass.479.396
SMILESFC(F)(F)c1cccnc1N1CCC(=CC1)C(=O)Nc1ccc(cc1)S(=O)(=O)C(F)(F)F