Reaction Details
TargetProstaglandin G/H synthase 1
LigandBDBM11639
Substrate/Competitorn/a
Meas. Tech.ChEMBL_511542 (CHEMBL980985)
IC50 16000±n/a nM
Citation Biava, MPorretta, GCPoce, GSupino, SManetti, FForli, SBotta, MSautebin, LRossi, APergola, CGhelardini, CNorcini, MMakovec, FGiordani, AAnzellotti, PCirilli, RFerretti, RGallinella, BLa Torre, FAnzini, MPatrignani, P Synthesis, in vitro, and in vivo biological evaluation and molecular docking simulations of chiral alcohol and ether derivatives of the 1,5-diarylpyrrole scaffold as novel anti-inflammatory and analgesic agents. Bioorg Med Chem16:8072-81 (2008) 
 
Prostaglandin G/H synthase 1
Name:Prostaglandin G/H synthase 1
Type:Enzyme
Mol. Mass.:68692.62
Organism:Homo sapiens (Human)
Description:P23219
Residue:599
BDBM11639
NameBDBM11639
Synonyms:4-[5-(4-methylphenyl)-3-(trifluoromethyl)-1H-pyrazol-1-yl]benzene-1-sulfonamide CLX Celecoxib US11478464, Compound Celecoxib US8741944, Comparative Compound cid_2662
TypeSmall organic molecule
Emp. Form.C17H14F3N3O2S
Mol. Mass.381.372
SMILESCc1ccc(cc1)-c1cc(nn1-c1ccc(cc1)S(N)(=O)=O)C(F)(F)F