Reaction Details
TargetSodium/glucose cotransporter 2
LigandBDBM20875
Substrate/Competitorn/a
Meas. Tech.ChEMBL_496716 (CHEMBL1005353)
IC50 752±n/a nM
Citation Lansdell, MIBurring, DJHepworth, DStrawbridge, MGraham, EGuyot, TBetson, MSHart, JD Design and synthesis of fluorescent SGLT2 inhibitors. Bioorg Med Chem Lett18:4944-7 (2008) 
 
Sodium/glucose cotransporter 2
Name:Sodium/glucose cotransporter 2
Type:Protein
Mol. Mass.:72902.00
Organism:Homo sapiens (Human)
Description:P31639
Residue:672
BDBM20875
NameBDBM20875
Synonyms:1-(2,4-dihydroxy-6-{[(2S,3R,4S,5S,6R)-3,4,5-trihydroxy-6-(hydroxymethyl)oxan-2-yl]oxy}phenyl)-3-(4-hydroxyphenyl)propan-1-one CHEMBL245067 O-glucoside, 1 | Phlorizin
TypeNatural product
Emp. Form.C21H24O10
Mol. Mass.436.4093
SMILESOC[C@H]1O[C@@H](Oc2cc(O)cc(O)c2C(=O)CCc2ccc(O)cc2)[C@H](O)[C@@H](O)[C@@H]1O