Reaction Details
TargetSodium/glucose cotransporter 2
LigandBDBM50265176
Substrate/Competitorn/a
Meas. Tech.ChEMBL_496716 (CHEMBL1005353)
IC50 33±n/a nM
Citation Lansdell, MIBurring, DJHepworth, DStrawbridge, MGraham, EGuyot, TBetson, MSHart, JD Design and synthesis of fluorescent SGLT2 inhibitors. Bioorg Med Chem Lett18:4944-7 (2008) 
 
Sodium/glucose cotransporter 2
Name:Sodium/glucose cotransporter 2
Type:Protein
Mol. Mass.:72902.00
Organism:Homo sapiens (Human)
Description:P31639
Residue:672
BDBM50265176
NameBDBM50265176
Synonyms:(2S,3R,4R,5S,6R)-2-(4-chloro-3-(4-hydroxybenzyl)phenyl)-6-(hydroxymethyl)tetrahydro-2H-pyran-3,4,5-triol | CHEMBL497971
TypeSmall organic molecule
Emp. Form.C19H21ClO6
Mol. Mass.380.819
SMILESOC[C@H]1O[C@H]([C@H](O)[C@@H](O)[C@@H]1O)c1ccc(Cl)c(Cc2ccc(O)cc2)c1