Reaction Details
TargetAromatase
LigandBDBM8611
Substrate/Competitorn/a
Meas. Tech.ChEMBL_512768 (CHEMBL971579)
IC50 30±n/a nM
Citation Lucas, SHeim, RNegri, MAntes, IRies, CSchewe, KEBisi, AGobbi, SHartmann, RW Novel aldosterone synthase inhibitors with extended carbocyclic skeleton by a combined ligand-based and structure-based drug design approach. J Med Chem51:6138-49 (2008) 
 
Aromatase
Name:Aromatase
Type:Enzyme
Mol. Mass.:57888.92
Organism:Homo sapiens (Human)
Description:P11511
Residue:503
BDBM8611
NameBDBM8611
Synonyms:4-{5H,6H,7H,8H-imidazo[1,5-a]pyridin-5-yl}benzonitrile CHEMBL9298 US9271963, Fadrozole
TypeSmall organic molecule
Emp. Form.C14H13N3
Mol. Mass.223.2731
SMILESN#Cc1ccc(cc1)C1CCCc2cncn12