Reaction Details
TargetHistamine H3 receptor
LigandBDBM50263896
Substrate/Competitorn/a
Meas. Tech.ChEMBL_535494 (CHEMBL986121)
IC50 680±n/a nM
Citation Jitsuoka, MTsukahara, DIto, STanaka, TTakenaga, NTokita, SSato, N Synthesis and evaluation of a spiro-isobenzofuranone class of histamine H3 receptor inverse agonists. Bioorg Med Chem Lett18:5101-6 (2008) 
 
Histamine H3 receptor
Name:Histamine H3 receptor
Type:G Protein-Coupled Receptor (GPCR)
Mol. Mass.:48691.47
Organism:Homo sapiens (Human)
Description:Binding assays were using CHO cells stably expressing hH3R receptors.
Residue:445
BDBM50263896
NameBDBM50263896
Synonyms:CHEMBL501876 | N-methyl-N-(2-(piperidin-1-yl)ethyl)-3,4-dihydroisoquinoline-2(1H)-carboxamide
TypeSmall organic molecule
Emp. Form.C18H27N3O
Mol. Mass.301.4265
SMILESCN(CCN1CCCCC1)C(=O)N1CCc2ccccc2C1