Reaction Details
TargetHistamine H3 receptor
LigandBDBM50263898
Substrate/Competitorn/a
Meas. Tech.ChEMBL_535494 (CHEMBL986121)
IC50 237±n/a nM
Citation Jitsuoka, MTsukahara, DIto, STanaka, TTakenaga, NTokita, SSato, N Synthesis and evaluation of a spiro-isobenzofuranone class of histamine H3 receptor inverse agonists. Bioorg Med Chem Lett18:5101-6 (2008) 
 
Histamine H3 receptor
Name:Histamine H3 receptor
Type:G Protein-Coupled Receptor (GPCR)
Mol. Mass.:48691.47
Organism:Homo sapiens (Human)
Description:Binding assays were using CHO cells stably expressing hH3R receptors.
Residue:445
BDBM50263898
NameBDBM50263898
Synonyms:4-benzoyl-N-methyl-N-(2-(piperidin-1-yl)ethyl)piperidine-1-carboxamide | CHEMBL505783
TypeSmall organic molecule
Emp. Form.C21H31N3O2
Mol. Mass.357.4897
SMILESCN(CCN1CCCCC1)C(=O)N1CCC(CC1)C(=O)c1ccccc1