Reaction Details
TargetPotassium voltage-gated channel subfamily H member 2
LigandBDBM50263323
Substrate/Competitorn/a
Meas. Tech.ChEMBL_535515 (CHEMBL986141)
IC50>10000±n/a nM
Citation Jitsuoka, MTsukahara, DIto, STanaka, TTakenaga, NTokita, SSato, N Synthesis and evaluation of a spiro-isobenzofuranone class of histamine H3 receptor inverse agonists. Bioorg Med Chem Lett18:5101-6 (2008) 
 
Potassium voltage-gated channel subfamily H member 2
Name:Potassium voltage-gated channel subfamily H member 2
Type:Multi-pass membrane protein
Mol. Mass.:126672.65
Organism:Homo sapiens (Human)
Description:Q12809
Residue:1159
BDBM50263323
NameBDBM50263323
Synonyms:CHEMBL514217 | trans-3'-Oxo-3'H-spiro[cyclohexane-1,1'-isobenzofuran]-4-carboxylic acid methyl-(2-piperidin-1-yl-ethyl)-amide
TypeSmall organic molecule
Emp. Form.C22H30N2O3
Mol. Mass.370.4852
SMILESCN(CCN1CCCCC1)C(=O)[C@H]1CC[C@@]2(CC1)OC(=O)c1ccccc21