Reaction Details
TargetPotassium voltage-gated channel subfamily H member 2
LigandBDBM50263324
Substrate/Competitorn/a
Meas. Tech.ChEMBL_535515 (CHEMBL986141)
IC50>10000±n/a nM
Citation Jitsuoka, MTsukahara, DIto, STanaka, TTakenaga, NTokita, SSato, N Synthesis and evaluation of a spiro-isobenzofuranone class of histamine H3 receptor inverse agonists. Bioorg Med Chem Lett18:5101-6 (2008) 
 
Potassium voltage-gated channel subfamily H member 2
Name:Potassium voltage-gated channel subfamily H member 2
Type:Multi-pass membrane protein
Mol. Mass.:126672.65
Organism:Homo sapiens (Human)
Description:Q12809
Residue:1159
BDBM50263324
NameBDBM50263324
Synonyms:CHEMBL513893 | trans-5'-Methoxy-3'-oxo-3'H-spiro[cyclohexane-1,1'-isobenzofuran]-4-carboxylic acid methyl-(2-piperidin-1-yl-ethyl)-amide
TypeSmall organic molecule
Emp. Form.C23H32N2O4
Mol. Mass.400.5112
SMILESCOc1ccc2c(c1)C(=O)O[C@]21CC[C@@H](CC1)C(=O)N(C)CCN1CCCCC1