Reaction Details
TargetMu-type opioid receptor
LigandBDBM50253754
Substrate/Competitorn/a
Meas. Tech.ChEMBL_539632 (CHEMBL1025637)
Ki 0.600000±n/a nM
Citation Lazarova, NZoghbi, SSHong, JSeneca, NTuan, EGladding, RLLiow, JSTaku, AInnis, RBPike, VW Synthesis and evaluation of [N-methyl-11C]N-desmethyl-loperamide as a new and improved PET radiotracer for imaging P-gp function. J Med Chem51:6034-43 (2008) 
 
Mu-type opioid receptor
Name:Mu-type opioid receptor
Type:G Protein-Coupled Receptor (GPCR)
Mol. Mass.:44789.51
Organism:Homo sapiens (Human)
Description:P35372
Residue:400
BDBM50253754
NameBDBM50253754
Synonyms:4-(4-(4-chlorophenyl)-4-hydroxypiperidin-1-yl)-N-methyl-2,2-diphenylbutanamide | CHEMBL1627
TypeSmall organic molecule
Emp. Form.C28H31ClN2O2
Mol. Mass.463.011
SMILESCNC(=O)C(CCN1CCC(O)(CC1)c1ccc(Cl)cc1)(c1ccccc1)c1ccccc1