Reaction Details
TargetThrombopoietin receptor
LigandBDBM50248106
Substrate/Competitorn/a
Meas. Tech.ChEMBL_497069 (CHEMBL997705)
EC50 38±n/a nM
Citation Marsilje, THAlper, PBLu, WMutnick, DMichellys, PYHe, YKaranewsky, DSChow, DGerken, ALao, JKim, MJSeidel, HMTian, SS Optimization of small molecule agonists of the thrombopoietin (Tpo) receptor derived from a benzo[a]carbazole hit scaffold. Bioorg Med Chem Lett18:5259-62 (2008) 
 
Thrombopoietin receptor
Name:Thrombopoietin receptor
Type:PROTEIN
Mol. Mass.:71243.48
Organism:Homo sapiens (Human)
Description:ChEMBL_535587
Residue:635
BDBM50248106
NameBDBM50248106
Synonyms:CHEMBL461101 Eltrombopag olamine
TypeSmall organic molecule
Emp. Form.C25H22N4O4
Mol. Mass.442.4666
SMILESCc1[nH]n(-c2ccc(C)c(C)c2)c(=O)c1N=Nc1cccc(-c2cccc(c2)C(O)=O)c1O