Reaction Details
TargetD(2) dopamine receptor
LigandBDBM50116766
Substrate/Competitorn/a
Meas. Tech.ChEMBL_539669 (CHEMBL1028977)
Ki 3.1±n/a nM
Citation Chen, JCollins, GTZhang, JYang, CYLevant, BWoods, JWang, S Design, synthesis, and evaluation of potent and selective ligands for the dopamine 3 (D3) receptor with a novel in vivo behavioral profile. J Med Chem51:5905-8 (2008) 
 
D(2) dopamine receptor
Name:D(2) dopamine receptor
Type:G Protein-Coupled Receptor (GPCR)
Mol. Mass.:50931.60
Organism:Rattus norvegicus (rat)
Description:P61169
Residue:444
BDBM50116766
NameBDBM50116766
Synonyms:(-)-Pramipexole 2,6-Benzothiazolediamine, 4,5,6,7-tetrahydro-N(sup 6)-propyl-, (S)- PRAMIPEXOLE | cid_119570
TypeSmall organic molecule
Emp. Form.C10H17N3S
Mol. Mass.211.327
SMILESCCCN[C@H]1CCc2nc(N)sc2C1