Reaction Details
TargetD(3) dopamine receptor
LigandBDBM50253472
Substrate/Competitorn/a
Meas. Tech.ChEMBL_539668 (CHEMBL1028976)
Ki 0.51±n/a nM
Citation Chen, JCollins, GTZhang, JYang, CYLevant, BWoods, JWang, S Design, synthesis, and evaluation of potent and selective ligands for the dopamine 3 (D3) receptor with a novel in vivo behavioral profile. J Med Chem51:5905-8 (2008) 
 
D(3) dopamine receptor
Name:D(3) dopamine receptor
Type:Protein
Mol. Mass.:49540.58
Organism:Rattus norvegicus (Rat)
Description:P19020
Residue:446
BDBM50253472
NameBDBM50253472
Synonyms:Benzofuran-2-carboxylic acid (4-{2-[((S)-2-amino-4,5,6,7-tetrahydro-benzothiazol-6-yl)-propyl-amino]-ethyl}-cyclohexyl)-amide | CHEMBL494511
TypeSmall organic molecule
Emp. Form.C27H36N4O2S
Mol. Mass.480.665
SMILESCCCN(CC[C@H]1CC[C@@H](CC1)NC(=O)c1cc2ccccc2o1)[C@H]1CCc2nc(N)sc2C1