Reaction Details
TargetD(2) dopamine receptor
LigandBDBM50253393
Substrate/Competitorn/a
Meas. Tech.ChEMBL_539669 (CHEMBL1028977)
Ki 307±n/a nM
Citation Chen, JCollins, GTZhang, JYang, CYLevant, BWoods, JWang, S Design, synthesis, and evaluation of potent and selective ligands for the dopamine 3 (D3) receptor with a novel in vivo behavioral profile. J Med Chem51:5905-8 (2008) 
 
D(2) dopamine receptor
Name:D(2) dopamine receptor
Type:G Protein-Coupled Receptor (GPCR)
Mol. Mass.:50931.60
Organism:Rattus norvegicus (rat)
Description:P61169
Residue:444
BDBM50253393
NameBDBM50253393
Synonyms:CHEMBL495327 | Naphthalene-2-carboxylic acid (4-{2-[((S)-2-amino-4,5,6,7-tetrahydro-benzothiazol-6-yl)-propyl-amino]-ethyl}-cyclohexyl)-amide
TypeSmall organic molecule
Emp. Form.C29H38N4OS
Mol. Mass.490.703
SMILESCCCN(CC[C@H]1CC[C@@H](CC1)NC(=O)c1ccc2ccccc2c1)[C@H]1CCc2nc(N)sc2C1