Reaction Details
TargetD(3) dopamine receptor
LigandBDBM50253394
Substrate/Competitorn/a
Meas. Tech.ChEMBL_539668 (CHEMBL1028976)
Ki 0.74±n/a nM
Citation Chen, JCollins, GTZhang, JYang, CYLevant, BWoods, JWang, S Design, synthesis, and evaluation of potent and selective ligands for the dopamine 3 (D3) receptor with a novel in vivo behavioral profile. J Med Chem51:5905-8 (2008) 
 
D(3) dopamine receptor
Name:D(3) dopamine receptor
Type:Protein
Mol. Mass.:49540.58
Organism:Rattus norvegicus (Rat)
Description:P19020
Residue:446
BDBM50253394
NameBDBM50253394
Synonyms:CHEMBL494308 | Naphthalene-2-carboxylic acid (4-{2-[((S)-2-amino-4,5,6,7-tetrahydro-benzothiazol-6-yl)-butyl-amino]-ethyl}-cyclohexyl)-amide
TypeSmall organic molecule
Emp. Form.C30H40N4OS
Mol. Mass.504.73
SMILESCCCCN(CC[C@H]1CC[C@@H](CC1)NC(=O)c1ccc2ccccc2c1)[C@H]1CCc2nc(N)sc2C1