Reaction Details
TargetNeuronal acetylcholine receptor subunit alpha-4
LigandBDBM50264884
Substrate/Competitorn/a
Meas. Tech.ChEMBL_497109 (CHEMBL998587)
EC50 18±n/a nM
Citation Albrecht, BKBerry, VBoezio, AACao, LClarkin, KGuo, WHarmange, JCHierl, MHuang, LJanosky, BKnop, JMalmberg, AMcDermott, JSNguyen, HQSpringer, SKWaldon, DWoodin, KMcDonough, SI Discovery and optimization of substituted piperidines as potent, selective, CNS-penetrant alpha4beta2 nicotinic acetylcholine receptor potentiators. Bioorg Med Chem Lett18:5209-12 (2008) 
 
Neuronal acetylcholine receptor subunit alpha-4
Name:Neuronal acetylcholine receptor subunit alpha-4
Type:n/a
Mol. Mass.:69963.49
Organism:Homo sapiens (Human)
Description:NACHRA4
Residue:627
BDBM50264884
NameBDBM50264884
Synonyms:3-(2-chlorophenyl)-5-(5-methyl-1-(piperidin-4-yl)-1H-pyrazol-4-yl)isoxazole | CHEMBL504947
TypeSmall organic molecule
Emp. Form.C18H19ClN4O
Mol. Mass.342.823
SMILESCc1c(cnn1C1CCNCC1)-c1cc(no1)-c1ccccc1Cl