Reaction Details
TargetNeuronal acetylcholine receptor subunit alpha-4
LigandBDBM50264800
Substrate/Competitorn/a
Meas. Tech.ChEMBL_497109 (CHEMBL998587)
EC50 3±n/a nM
Citation Albrecht, BKBerry, VBoezio, AACao, LClarkin, KGuo, WHarmange, JCHierl, MHuang, LJanosky, BKnop, JMalmberg, AMcDermott, JSNguyen, HQSpringer, SKWaldon, DWoodin, KMcDonough, SI Discovery and optimization of substituted piperidines as potent, selective, CNS-penetrant alpha4beta2 nicotinic acetylcholine receptor potentiators. Bioorg Med Chem Lett18:5209-12 (2008) 
 
Neuronal acetylcholine receptor subunit alpha-4
Name:Neuronal acetylcholine receptor subunit alpha-4
Type:n/a
Mol. Mass.:69963.49
Organism:Homo sapiens (Human)
Description:NACHRA4
Residue:627
BDBM50264800
NameBDBM50264800
Synonyms:3-(2-chloro-6-fluorophenyl)-5-(1-ethyl-2-(piperidin-4-yl)-1H-imidazol-5-yl)isoxazole | CHEMBL522610
TypeSmall organic molecule
Emp. Form.C19H20ClFN4O
Mol. Mass.374.84
SMILESCCn1c(cnc1C1CCNCC1)-c1cc(no1)-c1c(F)cccc1Cl