Reaction Details
TargetNeuromedin-B receptor
LigandBDBM50275902
Substrate/Competitorn/a
Meas. Tech.ChEMBL_496874 (CHEMBL998543)
EC50 0.55±n/a nM
Citation Carlton, DLCollin-Smith, LJDaniels, AJDeaton, DNGoetz, ASLaudeman, CPLittleton, TRMusso, DLMorgan, RJSzewczyk, JRZhang, C Discovery of small molecule agonists for the bombesin receptor subtype 3 (BRS-3) based on an omeprazole lead. Bioorg Med Chem Lett18:5451-5 (2008) 
 
Neuromedin-B receptor
Name:Neuromedin-B receptor
Type:Enzyme Catalytic Domain
Mol. Mass.:43447.11
Organism:Homo sapiens (Human)
Description:Bombesin 1 NMBR 0::P28336
Residue:390
BDBM50275902
NameBDBM50275902
Synonyms:CHEMBL525577 | D-Phe-Gln-Trp-Ala-Val-b-Ala-His-Phe-Nle-NH2
TypeSmall organic molecule
Emp. Form.C57H76N14O10
Mol. Mass.1117.3011
SMILESCCCC[C@H](NC(=O)[C@H](Cc1ccccc1)NC(=O)[C@H](Cc1cnc[nH]1)NC(=O)[C@@H](C)NC(=O)[C@@H](NC(=O)[C@H](C)NC(=O)[C@H](Cc1c[nH]c2ccccc12)NC(=O)[C@H](CCC(N)=O)NC(=O)[C@H](N)Cc1ccccc1)C(C)C)C(N)=O