Reaction Details
TargetCarbonic anhydrase 1
LigandBDBM26193
Substrate/Competitorn/a
Meas. Tech.ChEMBL_497171 (CHEMBL1002071)
Ki 620000±n/a nM
Citation Bayram, ESenturk, MKufrevioglu, OISupuran, CT In vitro inhibition of salicylic acid derivatives on human cytosolic carbonic anhydrase isozymes I and II. Bioorg Med Chem16:9101-5 (2008) 
 
Carbonic anhydrase 1
Name:Carbonic anhydrase 1
Type:Enzyme
Mol. Mass.:28873.37
Organism:Homo sapiens (Human)
Description:P00915
Residue:261
BDBM26193
NameBDBM26193
Synonyms:2-Hydroxybenzoate, I CHEMBL424 salicylic acid
TypeSmall organic molecule
Emp. Form.C7H6O3
Mol. Mass.138.1207
SMILESOC(=O)c1ccccc1O