Reaction Details
TargetSubstance-P receptor
LigandBDBM21016
Substrate/Competitorn/a
Meas. Tech.ChEMBL_539196 (CHEMBL1024700)
Ki 130±n/a nM
Citation Yamamoto, TNair, PJacobsen, NEDavis, PMa, SWNavratilova, EMoye, SLai, JYamamura, HIVanderah, TWPorreca, FHruby, VJ The importance of micelle-bound states for the bioactivities of bifunctional peptide derivatives for delta/mu opioid receptor agonists and neurokinin 1 receptor antagonists. J Med Chem51:6334-47 (2008) 
 
Substance-P receptor
Name:Substance-P receptor
Type:G Protein-Coupled Receptor (GPCR)
Mol. Mass.:46371.54
Organism:Rattus norvegicus (rat)
Description:Competition binding assays were carried out using membrane preparations from transfected CHO cells that constitutively expressed the rat NK1 receptor.
Residue:407
BDBM21016
NameBDBM21016
Synonyms:CHEMBL22870 L-732,138 N-acetyltryptophan 3,5-bis(trifluoromethyl)benzyl ester | [3,5-bis(trifluoromethyl)phenyl]methyl (2S)-2-acetamido-3-(1H-indol-3-yl)propanoate
TypeSmall organic molecule
Emp. Form.C22H18F6N2O3
Mol. Mass.472.3803
SMILESCC(=O)N[C@@H](Cc1c[nH]c2ccccc12)C(=O)OCc1cc(cc(c1)C(F)(F)F)C(F)(F)F