Reaction Details
TargetMuscarinic acetylcholine receptor M4
LigandBDBM50275588
Substrate/Competitorn/a
Meas. Tech.ChEMBL_492760 (CHEMBL939448)
EC50 9.1±n/a nM
Citation Miller, NRDaniels, RNBridges, TMBrady, AEConn, PJLindsley, CW Synthesis and SAR of analogs of the M1 allosteric agonist TBPB. Part II: Amides, sulfonamides and ureas--the effect of capping the distal basic piperidine nitrogen. Bioorg Med Chem Lett18:5443-7 (2008) 
 
Muscarinic acetylcholine receptor M4
Name:Muscarinic acetylcholine receptor M4
Type:Enzyme Catalytic Domain
Mol. Mass.:53079.31
Organism:Homo sapiens (Human)
Description:Cholinergic, muscarinic M4 CHRM4 HUMAN M3::P08173
Residue:479
BDBM50275588
NameBDBM50275588
Synonyms:2-(4-(2-oxo-2,3-dihydro-1H-benzo[d]imidazol-1-yl)-1,4'-bipiperidin-1'-yl)ethyl carbamate | CHEMBL485913
TypeSmall organic molecule
Emp. Form.C20H29N5O3
Mol. Mass.387.476
SMILESNC(=O)OCCN1CCC(CC1)N1CCC(CC1)n1c2ccccc2[nH]c1=O