Reaction Details
TargetMitogen-activated protein kinase 1
LigandBDBM50275656
Substrate/Competitorn/a
Meas. Tech.ChEMBL_492772 (CHEMBL939460)
IC50 16900±n/a nM
Citation Park, HBahn, YJJeong, DGWoo, EJKwon, JSRyu, SE Identification of novel inhibitors of extracellular signal-regulated kinase 2 based on the structure-based virtual screening. Bioorg Med Chem Lett18:5372-6 (2008) 
 
Mitogen-activated protein kinase 1
Name:Mitogen-activated protein kinase 1
Type:Ser/Thr Protein Kinase
Mol. Mass.:41392.76
Organism:Homo sapiens (Human)
Description:P28482
Residue:360
BDBM50275656
NameBDBM50275656
Synonyms:5-(4-methylbenzyloxy)-2-(4-phenyl-1H-pyrazol-3-yl)phenol | CHEMBL520871
TypeSmall organic molecule
Emp. Form.C23H20N2O2
Mol. Mass.356.4171
SMILESCc1ccc(COc2ccc(-c3n[nH]cc3-c3ccccc3)c(O)c2)cc1