Reaction Details
TargetMitogen-activated protein kinase 1
LigandBDBM50275620
Substrate/Competitorn/a
Meas. Tech.ChEMBL_492772 (CHEMBL939460)
IC50 14300±n/a nM
Citation Park, HBahn, YJJeong, DGWoo, EJKwon, JSRyu, SE Identification of novel inhibitors of extracellular signal-regulated kinase 2 based on the structure-based virtual screening. Bioorg Med Chem Lett18:5372-6 (2008) 
 
Mitogen-activated protein kinase 1
Name:Mitogen-activated protein kinase 1
Type:Ser/Thr Protein Kinase
Mol. Mass.:41392.76
Organism:Homo sapiens (Human)
Description:P28482
Residue:360
BDBM50275620
NameBDBM50275620
Synonyms:3-benzyl-5-(4-hydroxy-3-methoxybenzylidene)-2-thioxothiazolidin-4-one | CHEMBL487153
TypeSmall organic molecule
Emp. Form.C18H15NO3S2
Mol. Mass.357.447
SMILESCOc1cc(\C=C2/SC(=S)N(Cc3ccccc3)C2=O)ccc1O