Reaction Details
TargetMitogen-activated protein kinase 1
LigandBDBM50275619
Substrate/Competitorn/a
Meas. Tech.ChEMBL_492772 (CHEMBL939460)
IC50 5500±n/a nM
Citation Park, HBahn, YJJeong, DGWoo, EJKwon, JSRyu, SE Identification of novel inhibitors of extracellular signal-regulated kinase 2 based on the structure-based virtual screening. Bioorg Med Chem Lett18:5372-6 (2008) 
 
Mitogen-activated protein kinase 1
Name:Mitogen-activated protein kinase 1
Type:Ser/Thr Protein Kinase
Mol. Mass.:41392.76
Organism:Homo sapiens (Human)
Description:P28482
Residue:360
BDBM50275619
NameBDBM50275619
Synonyms:3-benzyl-5-(4-hydroxybenzylidene)-2-thioxothiazolidin-4-one | CHEMBL520882
TypeSmall organic molecule
Emp. Form.C17H13NO2S2
Mol. Mass.327.421
SMILESOc1ccc(\C=C2/SC(=S)N(Cc3ccccc3)C2=O)cc1