Reaction Details
TargetcAMP-specific 3',5'-cyclic phosphodiesterase 4A
LigandBDBM50274789
Substrate/Competitorn/a
Meas. Tech.ChEMBL_536739 (CHEMBL984533)
IC50 0.37±n/a nM
Citation Guay, DBoulet, LFriesen, RWGirard, MHamel, PHuang, ZLaliberté, FLaliberté, SMancini, JAMuise, EPon, DStyhler, A Optimization and structure-activity relationship of a series of 1-phenyl-1,8-naphthyridin-4-one-3-carboxamides: identification of MK-0873, a potent and effective PDE4 inhibitor. Bioorg Med Chem Lett18:5554-8 (2008) 
 
cAMP-specific 3',5'-cyclic phosphodiesterase 4A
Name:cAMP-specific 3',5'-cyclic phosphodiesterase 4A
Type:Enzyme
Mol. Mass.:98113.27
Organism:Homo sapiens (Human)
Description:P27815
Residue:886
BDBM50274789
NameBDBM50274789
Synonyms:1-(3'-Acetyl-biphenyl-3-yl)-4-oxo-1,4-dihydro-[1,8]naphthyridine-3-carboxylic acid isopropylamide | CHEMBL464804
TypeSmall organic molecule
Emp. Form.C26H23N3O3
Mol. Mass.425.4791
SMILESCC(C)NC(=O)c1cn(-c2cccc(c2)-c2cccc(c2)C(C)=O)c2ncccc2c1=O