Reaction Details
TargetHistamine H3 receptor
LigandBDBM50274577
Substrate/Competitorn/a
Meas. Tech.ChEMBL_537241 (CHEMBL981856)
IC50 60±n/a nM
Citation Nagase, TMizutani, TSekino, EIshikawa, SIto, SMitobe, YMiyamoto, YYoshimoto, RTanaka, TIshihara, ATakenaga, NTokita, SSato, N Synthesis and evaluation of structurally constrained quinazolinone derivatives as potent and selective histamine H3 receptor inverse agonists. J Med Chem51:6889-901 (2008) 
 
Histamine H3 receptor
Name:Histamine H3 receptor
Type:G Protein-Coupled Receptor (GPCR)
Mol. Mass.:48691.47
Organism:Homo sapiens (Human)
Description:Binding assays were using CHO cells stably expressing hH3R receptors.
Residue:445
BDBM50274577
NameBDBM50274577
Synonyms:2-Methyl-3-(4-[(1-propyl-4-piperidinyl)oxy]phenyl)-4(3H)-quinazolinone | CHEMBL484199
TypeSmall organic molecule
Emp. Form.C23H27N3O2
Mol. Mass.377.4794
SMILESCCCN1CCC(CC1)Oc1ccc(cc1)-n1c(C)nc2ccccc2c1=O