Reaction Details
TargetHistamine H3 receptor
LigandBDBM50274038
Substrate/Competitorn/a
Meas. Tech.ChEMBL_537241 (CHEMBL981856)
IC50 1.5±n/a nM
Citation Nagase, TMizutani, TSekino, EIshikawa, SIto, SMitobe, YMiyamoto, YYoshimoto, RTanaka, TIshihara, ATakenaga, NTokita, SSato, N Synthesis and evaluation of structurally constrained quinazolinone derivatives as potent and selective histamine H3 receptor inverse agonists. J Med Chem51:6889-901 (2008) 
 
Histamine H3 receptor
Name:Histamine H3 receptor
Type:G Protein-Coupled Receptor (GPCR)
Mol. Mass.:48691.47
Organism:Homo sapiens (Human)
Description:Binding assays were using CHO cells stably expressing hH3R receptors.
Residue:445
BDBM50274038
NameBDBM50274038
Synonyms:3-(4-[(1-Cyclobutyl-4-piperidinyl)oxy]phenyl)-6-methoxy-2-methyl-4(3H)-quinazolinone | CHEMBL484189
TypeSmall organic molecule
Emp. Form.C25H29N3O3
Mol. Mass.419.5161
SMILESCOc1ccc2nc(C)n(-c3ccc(OC4CCN(CC4)C4CCC4)cc3)c(=O)c2c1