Reaction Details
TargetPotassium voltage-gated channel subfamily H member 2
LigandBDBM50274040
Substrate/Competitorn/a
Meas. Tech.ChEMBL_537242 (CHEMBL981857)
IC50>10000±n/a nM
Citation Nagase, TMizutani, TSekino, EIshikawa, SIto, SMitobe, YMiyamoto, YYoshimoto, RTanaka, TIshihara, ATakenaga, NTokita, SSato, N Synthesis and evaluation of structurally constrained quinazolinone derivatives as potent and selective histamine H3 receptor inverse agonists. J Med Chem51:6889-901 (2008) 
 
Potassium voltage-gated channel subfamily H member 2
Name:Potassium voltage-gated channel subfamily H member 2
Type:Multi-pass membrane protein
Mol. Mass.:126672.65
Organism:Homo sapiens (Human)
Description:Q12809
Residue:1159
BDBM50274040
NameBDBM50274040
Synonyms:3-(4-[(1-Cyclobutyl-4-piperidinyl)oxy]phenyl)-8-methoxy-2-methyl-4(3H)-quinazolinone | CHEMBL485389
TypeSmall organic molecule
Emp. Form.C25H29N3O3
Mol. Mass.419.5161
SMILESCOc1cccc2c1nc(C)n(-c1ccc(OC3CCN(CC3)C3CCC3)cc1)c2=O